Target
Prostaglandin E2 receptor EP3 subtype
Ligand
BDBM50193930
Substrate
Meas. Tech.
ChEMBL_424228 (CHEMBL909002)
Ki
5±n/a nM
Citation
 Belley, MChan, CCGareau, YGallant, MJuteau, HHoude, KLachance, NLabelle, MSawyer, NTremblay, NLamontagne, SCarrière, MCDenis, DGreig, GMSlipetz, DGordon, RChauret, NLi, CZamboni, RJMetters, KM Comparison between two classes of selective EP(3) antagonists and their biological activities. Bioorg Med Chem Lett 16:5639-42 (2006)  
Target
Name:
Prostaglandin E2 receptor EP3 subtype
Synonyms:
PE2R3_HUMAN PGE2-R Prostaglandin E2 receptor Prostaglandin E2 receptor EP3 subtype (EP3) Prostaglandin E2 receptor EP3D subtype (EP3D) | Prostanoid EP3 receptor
Type:
Enzyme
Mol. Mass.:
43335.03
Organism:
Homo sapiens (Human)
Description:
P43115
Residue:
390
  
Inhibitor
Name:
BDBM50193930
Synonyms:
3-(2-((E)-3-phenylprop-1-enyl)phenyl)-N-(thiophen-2-ylsulfonyl)acrylamide | CHEMBL384878
Type:
Small organic molecule
Emp. Form.:
C22H19NO3S2
Mol. Mass.:
409.521
SMILES:
O=C(NS(=O)(=O)c1cccs1)\C=C\c1ccccc1\C=C\Cc1ccccc1
: