Target
Ectonucleoside triphosphate diphosphohydrolase 1
Ligand
BDBM50195359
Substrate
Meas. Tech.
ChEMBL_424930 (CHEMBL911342)
Ki
27000±n/a nM
Citation
 Müller, CEIqbal, JBaqi, YZimmermann, HRöllich, AStephan, H Polyoxometalates--a new class of potent ecto-nucleoside triphosphate diphosphohydrolase (NTPDase) inhibitors. Bioorg Med Chem Lett 16:5943-7 (2006)  
Target
Name:
Ectonucleoside triphosphate diphosphohydrolase 1
Synonyms:
ATPDase Cd39 Ecto-ATP diphosphohydrolase Entpd1 NTPDase 1
Type:
PROTEIN
Mol. Mass.:
57412.31
Organism:
Rattus norvegicus
Description:
ChEMBL_463990
Residue:
511
  
Inhibitor
Name:
BDBM50195359
Synonyms:
ARL-67156 | CHEMBL223145
Type:
Small organic molecule
Emp. Form.:
C15H20Br2N5O12P3
Mol. Mass.:
715.077
SMILES:
CCN(CC)c1ncnc2n(cnc12)[C@@H]1O[C@H](COP([O-])(=O)OP([O-])(=O)C(Br)(Br)P([O-])([O-])=O)[C@@H](O)[C@H]1O
: