Target
Liver carboxylesterase 1
Ligand
BDBM50204479
Substrate
Meas. Tech.
ChEMBL_428057 (CHEMBL914371)
IC50
>100000±n/a nM
Citation
 Romero, FADu, WHwang, IRayl, TJKimball, FSLeung, DHoover, HSApodaca, RLBreitenbucher, JGCravatt, BFBoger, DL Potent and selective alpha-ketoheterocycle-based inhibitors of the anandamide and oleamide catabolizing enzyme, fatty acid amide hydrolase. J Med Chem 50:1058-68 (2007)  
Target
Name:
Liver carboxylesterase 1
Synonyms:
Acyl coenzyme A:cholesterol acyltransferase CES1 EST1_HUMAN Serine hydrolase (CES1)
Type:
Protein
Mol. Mass.:
62520.83
Organism:
Homo sapiens (Human)
Description:
Residue:
567
  
Inhibitor
Name:
BDBM50204479
Synonyms:
3-(2-(7-phenylheptanoyl)oxazol-5-yl)benzamide | CHEMBL223406
Type:
Small organic molecule
Emp. Form.:
C23H24N2O3
Mol. Mass.:
376.4483
SMILES:
NC(=O)c1cccc(c1)-c1cnc(o1)C(=O)CCCCCCc1ccccc1
: