Target
Neutral cholesterol ester hydrolase 1
Ligand
BDBM50204478
Substrate
Meas. Tech.
ChEMBL_428056 (CHEMBL914788)
IC50
>100000±n/a nM
Citation
 Romero, FADu, WHwang, IRayl, TJKimball, FSLeung, DHoover, HSApodaca, RLBreitenbucher, JGCravatt, BFBoger, DL Potent and selective alpha-ketoheterocycle-based inhibitors of the anandamide and oleamide catabolizing enzyme, fatty acid amide hydrolase. J Med Chem 50:1058-68 (2007)  
Target
Name:
Neutral cholesterol ester hydrolase 1
Synonyms:
AADACL1 NCEH1 | NCEH1_HUMAN
Type:
PROTEIN
Mol. Mass.:
45810.81
Organism:
Homo sapiens (Human)
Description:
ChEMBL_835312
Residue:
408
  
Inhibitor
Name:
BDBM50204478
Synonyms:
1-(5-(4-methylpyridin-2-yl)oxazol-2-yl)-7-phenylheptan-1-one | CHEMBL219658
Type:
Small organic molecule
Emp. Form.:
C22H24N2O2
Mol. Mass.:
348.4382
SMILES:
Cc1ccnc(c1)-c1cnc(o1)C(=O)CCCCCCc1ccccc1
: