Target
Neutral cholesterol ester hydrolase 1
Ligand
BDBM50204499
Substrate
Meas. Tech.
ChEMBL_428056 (CHEMBL914788)
IC50
>100000±n/a nM
Citation
 Romero, FADu, WHwang, IRayl, TJKimball, FSLeung, DHoover, HSApodaca, RLBreitenbucher, JGCravatt, BFBoger, DL Potent and selective alpha-ketoheterocycle-based inhibitors of the anandamide and oleamide catabolizing enzyme, fatty acid amide hydrolase. J Med Chem 50:1058-68 (2007)  
Target
Name:
Neutral cholesterol ester hydrolase 1
Synonyms:
AADACL1 NCEH1 | NCEH1_HUMAN
Type:
PROTEIN
Mol. Mass.:
45810.81
Organism:
Homo sapiens (Human)
Description:
ChEMBL_835312
Residue:
408
  
Inhibitor
Name:
BDBM50204499
Synonyms:
CHEMBL220379 | methyl 2-(2-(7-phenylheptanoyl)oxazol-5-yl)isonicotinate
Type:
Small organic molecule
Emp. Form.:
C23H24N2O4
Mol. Mass.:
392.4477
SMILES:
COC(=O)c1ccnc(c1)-c1cnc(o1)C(=O)CCCCCCc1ccccc1
: