Target
Fatty-acid amide hydrolase 1
Ligand
BDBM50204531
Substrate
Meas. Tech.
ChEMBL_428054 (CHEMBL914372)
Ki
40±n/a nM
Citation
 Romero, FADu, WHwang, IRayl, TJKimball, FSLeung, DHoover, HSApodaca, RLBreitenbucher, JGCravatt, BFBoger, DL Potent and selective alpha-ketoheterocycle-based inhibitors of the anandamide and oleamide catabolizing enzyme, fatty acid amide hydrolase. J Med Chem 50:1058-68 (2007)  
Target
Name:
Fatty-acid amide hydrolase 1
Synonyms:
Anandamide amidohydrolase FAAH FAAH1_HUMAN Fatty-acid amide hydrolase (FAAH) Oleamide hydrolase 1
Type:
Protein
Mol. Mass.:
63071.19
Organism:
Homo sapiens (Human)
Description:
O00519
Residue:
579
  
Inhibitor
Name:
BDBM50204531
Synonyms:
1-(5-(3-methoxyphenyl)oxazol-2-yl)-7-phenylheptan-1-one | CHEMBL220518
Type:
Small organic molecule
Emp. Form.:
C23H25NO3
Mol. Mass.:
363.4495
SMILES:
COc1cccc(c1)-c1cnc(o1)C(=O)CCCCCCc1ccccc1
: