Target
Fatty-acid amide hydrolase 1
Ligand
BDBM50204516
Substrate
Meas. Tech.
ChEMBL_428054 (CHEMBL914372)
IC50
100±n/a nM
Citation
 Romero, FADu, WHwang, IRayl, TJKimball, FSLeung, DHoover, HSApodaca, RLBreitenbucher, JGCravatt, BFBoger, DL Potent and selective alpha-ketoheterocycle-based inhibitors of the anandamide and oleamide catabolizing enzyme, fatty acid amide hydrolase. J Med Chem 50:1058-68 (2007)  
Target
Name:
Fatty-acid amide hydrolase 1
Synonyms:
Anandamide amidohydrolase FAAH FAAH1_HUMAN Fatty-acid amide hydrolase (FAAH) Oleamide hydrolase 1
Type:
Protein
Mol. Mass.:
63071.19
Organism:
Homo sapiens (Human)
Description:
O00519
Residue:
579
  
Inhibitor
Name:
BDBM50204516
Synonyms:
6-(2-(7-phenylheptanoyl)oxazol-5-yl)picolinic acid CHEMBL219942
Type:
Small organic molecule
Emp. Form.:
C22H22N2O4
Mol. Mass.:
378.4211
SMILES:
OC(=O)c1cccc(n1)-c1cnc(o1)C(=O)CCCCCCc1ccccc1
: