Target
Fatty-acid amide hydrolase 1
Ligand
BDBM50411296
Substrate
Meas. Tech.
ChEMBL_428054 (CHEMBL914372)
Ki
24±n/a nM
Citation
 Romero, FADu, WHwang, IRayl, TJKimball, FSLeung, DHoover, HSApodaca, RLBreitenbucher, JGCravatt, BFBoger, DL Potent and selective alpha-ketoheterocycle-based inhibitors of the anandamide and oleamide catabolizing enzyme, fatty acid amide hydrolase. J Med Chem 50:1058-68 (2007)  
Target
Name:
Fatty-acid amide hydrolase 1
Synonyms:
Anandamide amidohydrolase FAAH FAAH1_HUMAN Fatty-acid amide hydrolase (FAAH) Oleamide hydrolase 1
Type:
Protein
Mol. Mass.:
63071.19
Organism:
Homo sapiens (Human)
Description:
O00519
Residue:
579
  
Inhibitor
Name:
BDBM50411296
Synonyms:
CHEMBL375746
Type:
Small organic molecule
Emp. Form.:
C21H26N2O4
Mol. Mass.:
370.4421
SMILES:
O=C(CCCCCCc1ccccc1)c1ncc(o1)C(=O)N1CCOCC1
: