Target
Fatty-acid amide hydrolase 1
Ligand
BDBM50204566
Substrate
Meas. Tech.
ChEMBL_428054 (CHEMBL914372)
Ki
90±n/a nM
Citation
 Romero, FADu, WHwang, IRayl, TJKimball, FSLeung, DHoover, HSApodaca, RLBreitenbucher, JGCravatt, BFBoger, DL Potent and selective alpha-ketoheterocycle-based inhibitors of the anandamide and oleamide catabolizing enzyme, fatty acid amide hydrolase. J Med Chem 50:1058-68 (2007)  
Target
Name:
Fatty-acid amide hydrolase 1
Synonyms:
Anandamide amidohydrolase FAAH FAAH1_HUMAN Fatty-acid amide hydrolase (FAAH) Oleamide hydrolase 1
Type:
Protein
Mol. Mass.:
63071.19
Organism:
Homo sapiens (Human)
Description:
O00519
Residue:
579
  
Inhibitor
Name:
BDBM50204566
Synonyms:
1-(5-(4-aminophenyl)oxazol-2-yl)-7-phenylheptan-1-one | CHEMBL219955
Type:
Small organic molecule
Emp. Form.:
C22H24N2O2
Mol. Mass.:
348.4382
SMILES:
Nc1ccc(cc1)-c1cnc(o1)C(=O)CCCCCCc1ccccc1
: