Target
Vitamin D3 receptor
Ligand
BDBM50205235
Substrate
Meas. Tech.
ChEMBL_428141 (CHEMBL915777)
EC50
0.2±n/a nM
Citation
 Yamamoto, KInaba, YYoshimoto, NChoi, MDeLuca, HFYamada, S 22-Alkyl-20-epi-1alpha,25-dihydroxyvitamin D3 compounds of superagonistic activity: syntheses, biological activities and interaction with the receptor. J Med Chem 50:932-9 (2007)  
Target
Name:
Vitamin D3 receptor
Synonyms:
1,25-dihydroxyvitamin D3 receptor Nuclear receptor subfamily 1 group I member 1 VDR | VDR_HUMAN
Type:
Protein
Mol. Mass.:
48288.72
Organism:
Homo sapiens (Human)
Description:
P11473
Residue:
427
  
Inhibitor
Name:
BDBM50205235
Synonyms:
(20S,22R)-22-methyl-1-alpha-25-dihydroxy-vitamin D3 | CHEMBL375811
Type:
Small organic molecule
Emp. Form.:
C31H52O3
Mol. Mass.:
472.7428
SMILES:
CCCC[C@H](CCC(C)(C)O)[C@H](C)[C@H]1CCC2\C(CCC[C@]12C)=C\C=C1\C[C@@H](O)C[C@H](O)C1=C
: