Target
P2Y purinoceptor 4
Ligand
BDBM50205413
Substrate
Meas. Tech.
ChEMBL_428324 (CHEMBL917102)
EC50
130±n/a nM
Citation
 Ivanov, AAKo, HCosyn, LMaddileti, SBesada, PFricks, ICostanzi, SHarden, TKCalenbergh, SVJacobson, KA Molecular modeling of the human P2Y2 receptor and design of a selective agonist, 2'-amino-2'-deoxy-2-thiouridine 5'-triphosphate. J Med Chem 50:1166-76 (2007)  
Target
Name:
P2Y purinoceptor 4
Synonyms:
NRU P2RY4 P2Y purinoceptor 4 Pyrimidinergic receptor P2Y4 Uridine nucleotide receptor
Type:
PROTEIN
Mol. Mass.:
40977.17
Organism:
Homo sapiens (Human)
Description:
ChEMBL_751027
Residue:
365
  
Inhibitor
Name:
BDBM50205413
Synonyms:
CHEMBL221326 P1,P4-Bis(5'-uridyl) tetrahydrogen tetraphosphate
Type:
Small organic molecule
Emp. Form.:
C18H26N4O23P4
Mol. Mass.:
790.3071
SMILES:
O[C@@H]1[C@@H](COP(O)(=O)OP(O)(=O)OP(O)(=O)OP(O)(=O)OC[C@H]2O[C@H]([C@H](O)[C@@H]2O)n2ccc(=O)[nH]c2=O)O[C@H]([C@@H]1O)n1ccc(=O)[nH]c1=O
: