Target
P2Y purinoceptor 4
Ligand
BDBM50118213
Substrate
Meas. Tech.
ChEMBL_428324 (CHEMBL917102)
EC50
73±n/a nM
Citation
 Ivanov, AAKo, HCosyn, LMaddileti, SBesada, PFricks, ICostanzi, SHarden, TKCalenbergh, SVJacobson, KA Molecular modeling of the human P2Y2 receptor and design of a selective agonist, 2'-amino-2'-deoxy-2-thiouridine 5'-triphosphate. J Med Chem 50:1166-76 (2007)  
Target
Name:
P2Y purinoceptor 4
Synonyms:
NRU P2RY4 P2Y purinoceptor 4 Pyrimidinergic receptor P2Y4 Uridine nucleotide receptor
Type:
PROTEIN
Mol. Mass.:
40977.17
Organism:
Homo sapiens (Human)
Description:
ChEMBL_751027
Residue:
365
  
Inhibitor
Name:
BDBM50118213
Synonyms:
5'-UTP H4utp uridine 5'-(tetrahydrogen triphosphate) | uridine 5'-triphosphoric acid
Type:
Small organic molecule
Emp. Form.:
C9H15N2O15P3
Mol. Mass.:
484.1411
SMILES:
O[C@@H]1[C@@H](COP(O)(=O)OP(O)(=O)OP(O)(O)=O)O[C@H]([C@@H]1O)n1ccc(=O)[nH]c1=O
: