Target
Tyrosine-protein kinase Fyn
Ligand
BDBM50133496
Substrate
Meas. Tech.
ChEMBL_428432 (CHEMBL919501)
Ki
7500±n/a nM
Citation
 Jelic, DMildner, BKostrun, SNujic, KVerbanac, DCulic, OAntolovic, RBrandt, W Homology modeling of human Fyn kinase structure: discovery of rosmarinic acid as a new Fyn kinase inhibitor and in silico study of its possible binding modes. J Med Chem 50:1090-100 (2007)  
Target
Name:
Tyrosine-protein kinase Fyn
Synonyms:
FYN Proto-oncogene Syn SLK Src-like kinase | p59-Fyn
Type:
Enzyme
Mol. Mass.:
60762.21
Organism:
Homo sapiens (Human)
Description:
P06241
Residue:
537
  
Inhibitor
Name:
BDBM50133496
Synonyms:
(2R)-3-(3,4-dihydroxyphenyl)-2-[(2E)-3-(3,4-dihydroxyphenyl)prop-2-enoyloxy]propanoic acid CHEMBL324842 US10688093, Compound rosmarinic acid cid_5281792
Type:
Small organic molecule
Emp. Form.:
C18H16O8
Mol. Mass.:
360.3148
SMILES:
OC(=O)[C@@H](Cc1ccc(O)c(O)c1)OC(=O)\C=C\c1ccc(O)c(O)c1
: