Target
Sodium-dependent serotonin transporter
Ligand
BDBM50156915
Substrate
Meas. Tech.
ChEMBL_429833 (CHEMBL915414)
Ki
4.8±n/a nM
Citation
 Carroll, FIRunyon, SPAbraham, PNavarro, HKuhar, MJPollard, GTHoward, JL Monoamine transporter binding, locomotor activity, and drug discrimination properties of 3-(4-substituted-phenyl)tropane-2-carboxylic acid methyl ester isomers. J Med Chem 47:6401-9 (2004)  
Target
Name:
Sodium-dependent serotonin transporter
Synonyms:
5-HT Transporter 5HTT SC6A4_HUMAN SLC6A4 Serotonin transporter (5HTT) Sodium-dependent serotonin transporter (SERT) | Solute carrier family 6 member 4
Type:
Multi-pass membrane protein
Mol. Mass.:
70322.51
Organism:
Homo sapiens (Human)
Description:
P31645
Residue:
630
  
Inhibitor
Name:
BDBM50156915
Synonyms:
(2R,3S)-methyl 3-(4-chlorophenyl)-8-methyl-8-aza-bicyclo[3.2.1]octane-2-carboxylate CHEMBL375888
Type:
Small organic molecule
Emp. Form.:
C16H20ClNO2
Mol. Mass.:
293.789
SMILES:
COC(=O)[C@@H]1C2CCC(C[C@H]1c1ccc(Cl)cc1)N2C
: