Target
Delta-type opioid receptor
Ligand
BDBM50157792
Substrate
Meas. Tech.
ChEMBL_430155 (CHEMBL919064)
Ki
2±n/a nM
Citation
 Srivastava, SKShefali, SMiller, CNAceto, MDTraynor, JRLewis, JWHusbands, SM Effects of substitution on the pyrrole N atom in derivatives of tetrahydronaltrindole, tetrahydrooxymorphindole, and a related 4,5-epoxyphenylpyrrolomorphinan. J Med Chem 47:6645-8 (2004)  
Target
Name:
Delta-type opioid receptor
Synonyms:
D-OR-1 Delta opioid receptor OPIATE Delta OPRD1 OPRK1 | opioid receptor, delta 1
Type:
G Protein-Coupled Receptor (GPCR)
Mol. Mass.:
40382.98
Organism:
Homo sapiens (Human)
Description:
Competition binding assays were carried out using membrane preparations from transfected HN9.10 cells that constitutively expressed the delta opioid receptor.
Residue:
372
  
Inhibitor
Name:
BDBM50157792
Synonyms:
17-cyclopropylmethyl-6-7-didehydro-3,14-dihydroxy-4,5alpha-epoxy-1'-methyl-4',5',6',7'-tetrahydroindolo[2',3';6,7]morphinan | 22-cyclopropylmethyl-11-methyl-(1S,2S,13R)-14-oxa-11,22-diazaheptacyclo[13.9.1.01,13.02,21.04,12.05,10.019,25]pentacosa-4(12),5(10),15,17,19(25)-pentaene-2,16-diol
Type:
Small organic molecule
Emp. Form.:
C27H32N2O3
Mol. Mass.:
432.5546
SMILES:
Cn1c2CCCCc2c2C[C@@]3(O)C4Cc5ccc(O)c6O[C@@H](c12)[C@]3(CCN4CC1CC1)c56
: