Target
Rho-associated protein kinase 1/2
Ligand
BDBM50196687
Substrate
Meas. Tech.
ChEMBL_432047 (CHEMBL918244)
IC50
20±n/a nM
Citation
 Iwakubo, MTakami, AOkada, YKawata, TTagami, YOhashi, HSato, MSugiyama, TFukushima, KIijima, H Design and synthesis of Rho kinase inhibitors (II). Bioorg Med Chem 15:350-64 (2006)  
Target
Name:
Rho-associated protein kinase 1/2
Synonyms:
Rho-associated protein kinase Rho-associated protein kinase 2/Rho-kinase (ROCK I)
Type:
Mol. Mass.:
Description:
ASSAY_ID of EBI is 432392
Components:
This complex has 2 components.
Component 1
Name:
Rho-associated protein kinase 1
Synonyms:
ROCK-I ROCK1_HUMAN Rho-associated protein kinase Rho-associated, coiled-coil-containing protein kinase 1 Rho-kinase (ROCK I) p160 ROCK-1 | p160ROCK
Type:
Serine/threonine-protein kinase
Mol. Mass.:
158156.77
Organism:
Homo sapiens (Human)
Description:
Q13464
Residue:
1354
  
Component 2
Name:
Rho-associated protein kinase 2
Synonyms:
KIAA0619 ROCK2 Rho kinase 2 (ROCKII) Rho-associated protein kinase 2 (ROCK2) Rho-associated protein kinase 2/Transforming protein RhoA Rho-associated, coiled-coil-containing protein kinase II p164 ROCK-2
Type:
Protein
Mol. Mass.:
160885.43
Organism:
Homo sapiens (Human)
Description:
O75116
Residue:
1388
  
Component 3
Name:
Rho-associated protein kinase 2
Synonyms:
KIAA0619 ROCK2 Rho kinase 2 (ROCKII) Rho-associated protein kinase 2 (ROCK2) Rho-associated protein kinase 2/Transforming protein RhoA Rho-associated, coiled-coil-containing protein kinase II p164 ROCK-2
Type:
Protein
Mol. Mass.:
160885.43
Organism:
Homo sapiens (Human)
Description:
O75116
Residue:
1388
  
Inhibitor
Name:
BDBM50196687
Synonyms:
1-(2,6-dichlorobenzyl)-3-(1H-indazol-5-yl)urea CHEMBL225224
Type:
Small organic molecule
Emp. Form.:
C15H12Cl2N4O
Mol. Mass.:
335.188
SMILES:
Clc1cccc(Cl)c1CNC(=O)Nc1ccc2[nH]ncc2c1
: