Target
Metabotropic glutamate receptor 5
Ligand
BDBM50198702
Substrate
Meas. Tech.
ChEMBL_432825 (CHEMBL914081)
IC50
7±n/a nM
Citation
 Hintermann, SVranesic, IAllgeier, HBrülisauer, AHoyer, DLemaire, MMoenius, TUrwyler, SWhitebread, SGasparini, FAuberson, YP ABP688, a novel selective and high affinity ligand for the labeling of mGlu5 receptors: identification, in vitro pharmacology, pharmacokinetic and biodistribution studies. Bioorg Med Chem 15:903-14 (2006)  
Target
Name:
Metabotropic glutamate receptor 5
Synonyms:
GPRC1E GRM5_HUMAN metabotropic glutamate 5 | metabotropic glutamate 5a
Type:
Enzyme
Mol. Mass.:
132484.72
Organism:
Homo sapiens (Human)
Description:
Residue:
1212
  
Inhibitor
Name:
BDBM50198702
Synonyms:
(E)-3-((6-methylpyridin-2-yl)ethynyl)cyclohex-2-enone O-methyl oxime CHEMBL227853 | CHEMBL228196
Type:
Small organic molecule
Emp. Form.:
C15H16N2O
Mol. Mass.:
240.3003
SMILES:
CO\N=C1/CCCC(=C1)C#Cc1cccc(C)n1
: