Target
5-hydroxytryptamine receptor 1A
Ligand
BDBM50213574
Substrate
Meas. Tech.
ChEMBL_436893 (CHEMBL905198)
Ki
6320±n/a nM
Citation
 Chlon-Rzepa, GZmudzki, PZajdel, PBojarski, AJDuszynska, BNikiforuk, ATatarczynska, EPawlowski, M 7-Arylpiperazinylalkyl and 7-tetrahydroisoquinolinylalkyl derivatives of 8-alkoxy-purine-2,6-dione and some of their purine-2,6,8-trione analogs as 5-HT(1A), 5-HT(2A), and 5-HT(7) serotonin receptor ligands. Bioorg Med Chem 15:5239-50 (2007)  
Target
Name:
5-hydroxytryptamine receptor 1A
Synonyms:
5-HT-1A 5-HT1A 5-hydroxytryptamine receptor 1A (5HT1A) 5ht1a Htr1a Serotonin 1a (5-HT1a) receptor/Adrenergic receptor alpha-1 | Serotonin receptor 1A
Type:
G Protein-Coupled Receptor (GPCR)
Mol. Mass.:
46445.29
Organism:
Rattus norvegicus (rat)
Description:
Binding assays were performed using rat hippocampal membranes.
Residue:
422
  
Inhibitor
Name:
BDBM50213574
Synonyms:
7-{3-[1,2,3,4-tetrahydroisoquinolin-2-yl]-propyl}-1,3-dimethyl-7,9-dihydro-3H-purine-2,6,8-trione | CHEMBL389842
Type:
Small organic molecule
Emp. Form.:
C19H23N5O3
Mol. Mass.:
369.4176
SMILES:
Cn1c2[nH]c(=O)n(CCCN3CCc4ccccc4C3)c2c(=O)n(C)c1=O
: