Target
Cannabinoid receptor 2
Ligand
BDBM50215226
Substrate
Meas. Tech.
ChEMBL_437166 (CHEMBL906562)
IC50
>10000±n/a nM
Citation
 Brizzi, ACascio, MGBrizzi, VBisogno, TDinatolo, MTMartinelli, ATuccinardi, TDi Marzo, V Design, synthesis, binding, and molecular modeling studies of new potent ligands of cannabinoid receptors. Bioorg Med Chem 15:5406-16 (2007)  
Target
Name:
Cannabinoid receptor 2
Synonyms:
CANNABINOID CB2 CB2 CB2B CNR2_HUMAN Cannabinoid CB2 receptor Cannabinoid receptor 2 (CB2R) | hCB2
Type:
G Protein-Coupled Receptor (GPCR)
Mol. Mass.:
39690.94
Organism:
Homo sapiens (Human)
Description:
P34972
Residue:
360
  
Inhibitor
Name:
BDBM50215226
Synonyms:
11-(4-hexyl-3-hydroxy-phenoxy)-undecanoic acid(3-methoxy-4-hydroxy-phenyl)-amide | CHEMBL229816
Type:
Small organic molecule
Emp. Form.:
C31H47NO5
Mol. Mass.:
513.7086
SMILES:
CCCCCCc1ccc(OCCCCCCCCCCC(=O)NCc2ccc(OC)c(O)c2)cc1O
: