Target
Kappa-type opioid receptor
Ligand
BDBM50204457
Substrate
Meas. Tech.
ChEMBL_438283 (CHEMBL887389)
Ki
36±n/a nM
Citation
 Peng, XKnapp, BIBidlack, JMNeumeyer, JL High-affinity carbamate analogues of morphinan at opioid receptors. Bioorg Med Chem Lett 17:1508-11 (2007)  
Target
Name:
Kappa-type opioid receptor
Synonyms:
K-OR-1 Kappa-opioid receptor (KOR) Kappa-type opioid receptor (KOR) OPIATE Kappa OPRK1 kappa opioid receptor (KOR)
Type:
G Protein-Coupled Receptor (GPCR)
Mol. Mass.:
42648.76
Organism:
Homo sapiens (Human)
Description:
P41145
Residue:
380
  
Inhibitor
Name:
BDBM50204457
Synonyms:
CHEMBL241823 | MCL-431
Type:
Small organic molecule
Emp. Form.:
C20H28N2O2
Mol. Mass.:
328.4485
SMILES:
CCNC(=O)Oc1ccc2CC3C4CCCCC4(CCN3C)c2c1
: