Target
Phosphoenolpyruvate carboxykinase, cytosolic [GTP]
Ligand
BDBM50214016
Substrate
Meas. Tech.
ChEMBL_438958 (CHEMBL889301)
EC50
8200±n/a nM
Citation
 Pietranico, SLFoley, LHHuby, NYun, WDunten, PVermeulen, JWang, PToth, KRamsey, GGubler, MLWertheimer, SJ C-8 Modifications of 3-alkyl-1,8-dibenzylxanthines as inhibitors of human cytosolic phosphoenolpyruvate carboxykinase. Bioorg Med Chem Lett 17:3835-9 (2007)  
Target
Name:
Phosphoenolpyruvate carboxykinase, cytosolic [GTP]
Synonyms:
Cytosolic phosphoenolpyruvate carboxykinase (cPEPCK) PEPCK-C Phosphoenolpyruvate carboxykinase (PEPCK) Phosphoenolpyruvate carboxylase
Type:
Protein
Mol. Mass.:
69414.48
Organism:
Rattus norvegicus (Rat)
Description:
Residue:
622
  
Inhibitor
Name:
BDBM50214016
Synonyms:
CHEMBL243342 | N-(4-((1-(2-fluorobenzyl)-3-(cyclopropylmethyl)-2,6-dioxo-2,3,6,7-tetrahydro-1H-purin-8-yl)methyl)phenyl)-2-amino-4-methylthiazole-5-sulfonamide
Type:
Small organic molecule
Emp. Form.:
C27H26FN7O4S2
Mol. Mass.:
595.668
SMILES:
Cc1nc(N)sc1S(=O)(=O)Nc1ccc(Cc2nc3n(CC4CC4)c(=O)n(Cc4ccccc4F)c(=O)c3[nH]2)cc1
: