Target
Transient receptor potential cation channel subfamily V member 1
Ligand
BDBM50366620
Substrate
Meas. Tech.
ChEMBL_440725 (CHEMBL889822)
EC50
0.019±n/a nM
Citation
 Appendino, GEch-Chahad, AMinassi, ABacchiega, SDe Petrocellis, LDi Marzo, V Structure-activity relationships of the ultrapotent vanilloid resiniferatoxin (RTX): the homovanillyl moiety. Bioorg Med Chem Lett 17:132-5 (2006)  
Target
Name:
Transient receptor potential cation channel subfamily V member 1
Synonyms:
Capsaicin receptor Osm-9-like TRP channel 1 TRPV1_HUMAN Transient receptor potential cation channel subfamily V member 1 (TRPV1) Transient receptor potential cation channel subfamily V member 1(TRPV1) Vanilloid VR1 Vanilloid receptor 1 Vanilloid receptor 1 (VRI/TRPV1)
Type:
Protein
Mol. Mass.:
94960.75
Organism:
Homo sapiens (Human)
Description:
Q8NER1
Residue:
839
  
Inhibitor
Name:
BDBM50366620
Synonyms:
RESINIFERATOXIN
Type:
Small organic molecule
Emp. Form.:
C37H40O9
Mol. Mass.:
628.7081
SMILES:
COc1cc(CC(=O)OCC2=C[C@H]3[C@H]4OC5(Cc6ccccc6)O[C@@]4(C[C@@H](C)[C@]3(O5)[C@@H]3C=C(C)C(=O)[C@@]3(O)C2)C(C)=C)ccc1O
: