Target
Transient receptor potential cation channel subfamily V member 1
Ligand
BDBM50196617
Substrate
Meas. Tech.
ChEMBL_440725 (CHEMBL889822)
EC50
4.6±n/a nM
Citation
 Appendino, GEch-Chahad, AMinassi, ABacchiega, SDe Petrocellis, LDi Marzo, V Structure-activity relationships of the ultrapotent vanilloid resiniferatoxin (RTX): the homovanillyl moiety. Bioorg Med Chem Lett 17:132-5 (2006)  
Target
Name:
Transient receptor potential cation channel subfamily V member 1
Synonyms:
Capsaicin receptor Osm-9-like TRP channel 1 TRPV1_HUMAN Transient receptor potential cation channel subfamily V member 1 (TRPV1) Transient receptor potential cation channel subfamily V member 1(TRPV1) Vanilloid VR1 Vanilloid receptor 1 Vanilloid receptor 1 (VRI/TRPV1)
Type:
Protein
Mol. Mass.:
94960.75
Organism:
Homo sapiens (Human)
Description:
Q8NER1
Residue:
839
  
Inhibitor
Name:
BDBM50196617
Synonyms:
3-(4-hydroxy-3-methoxy-phenyl)-propionic acid (3aR,3bR,4R,5aR,8aR,8bS,11aR)-3b-benzyloxy-11a-hydroxy-5a-isopropenyl-2,4-dimethyl-1-oxo-1,3a,3b,4,5,5a,8a,8b,11,11a-decahydro-6,8-dioxa-indeno[5,4-e]azulen-10-ylmethyl ester | CHEMBL391598
Type:
Small organic molecule
Emp. Form.:
C38H44O9
Mol. Mass.:
644.7506
SMILES:
COc1cc(CCC(=O)OCC2=C[C@H]3[C@H]4OCO[C@]4(C[C@@H](C)[C@]3(OCc3ccccc3)[C@@H]3C=C(C)C(=O)[C@@]3(O)C2)C(C)=C)ccc1O
: