Target
Dihydrofolate reductase
Ligand
BDBM18050
Substrate
Meas. Tech.
ChEMBL_441096 (CHEMBL891311)
IC50
9±n/a nM
Citation
 Santos, MAEnyedy, EANuti, ERossello, AKrupenko, NIKrupenko, SA Methotrexate gamma-hydroxamate derivatives as potential dual target antitumor drugs. Bioorg Med Chem 15:1266-74 (2007)  
Target
Name:
Dihydrofolate reductase
Synonyms:
DHFR Dihydrofolate reductase (DHFR) | Tetrahydrofolate dehydrogenase
Type:
Enzyme
Mol. Mass.:
21453.99
Organism:
Homo sapiens (Human)
Description:
Recombinant human DHFR.
Residue:
187
  
Inhibitor
Name:
BDBM18050
Synonyms:
2-[(4-{[(2,4-diaminopteridin-6-yl)methyl](methyl)amino}phenyl)formamido]pentanedioic acid MTX cid_126941
Type:
Small organic molecule
Emp. Form.:
C20H22N8O5
Mol. Mass.:
454.4393
SMILES:
CN(Cc1cnc2nc(N)nc(N)c2n1)c1ccc(cc1)C(=O)N[C@@H](CCC(O)=O)C(O)=O
: