Target
Bcl-2-like protein 2
Ligand
BDBM50202275
Substrate
Meas. Tech.
ChEMBL_441639 (CHEMBL891870)
Ki
24100±n/a nM
Citation
 Xing, CWang, LTang, XSham, YY Development of selective inhibitors for anti-apoptotic Bcl-2 proteins from BHI-1. Bioorg Med Chem 15:2167-76 (2007)  
Target
Name:
Bcl-2-like protein 2
Synonyms:
Apoptosis regulator Bcl-W BCL-W BCLW Bcl2-L-2 | KIAA0271
Type:
Protein
Mol. Mass.:
20742.61
Organism:
Homo sapiens (Human)
Description:
Residue:
193
  
Inhibitor
Name:
BDBM50202275
Synonyms:
2-[5-(1-phenylbutylidene)-4-oxo-2-thioxothiazolidin-3-yl]-4-methylpentanoic acid | CHEMBL242126
Type:
Small organic molecule
Emp. Form.:
C19H23NO3S2
Mol. Mass.:
377.521
SMILES:
CCC\C(=C1\SC(=S)N([C@@H](CC(C)C)C(O)=O)C1=O)c1ccccc1
: