Target
Bcl-2-like protein 2
Ligand
BDBM25524
Substrate
Meas. Tech.
ChEMBL_441639 (CHEMBL891870)
Ki
106000±n/a nM
Citation
 Xing, CWang, LTang, XSham, YY Development of selective inhibitors for anti-apoptotic Bcl-2 proteins from BHI-1. Bioorg Med Chem 15:2167-76 (2007)  
Target
Name:
Bcl-2-like protein 2
Synonyms:
Apoptosis regulator Bcl-W BCL-W BCLW Bcl2-L-2 | KIAA0271
Type:
Protein
Mol. Mass.:
20742.61
Organism:
Homo sapiens (Human)
Description:
Residue:
193
  
Inhibitor
Name:
BDBM25524
Synonyms:
17,18-dimethoxy-21-methyl-5,7-dioxa-21-azapentacyclo[11.8.0.0^{2,10}.0^{4,8}.0^{14,19}]henicosa-1(13),2,4(8),9,11,14(19),15,17,20-nonaen-21-ium CHEMBL258893 Toddalin | chelerythrine
Type:
Small organic molecule
Emp. Form.:
C21H18NO4
Mol. Mass.:
348.3714
SMILES:
COc1ccc2c(c[n+](C)c3c4cc5OCOc5cc4ccc23)c1OC
: