Target
Nitric oxide synthase, endothelial
Ligand
BDBM50206064
Substrate
Meas. Tech.
ChEMBL_442515 (CHEMBL892680)
IC50
6000±n/a nM
Citation
 Patman, JBhardwaj, NRamnauth, JAnnedi, SCRenton, PMaddaford, SPRakhit, SAndrews, JS Novel 2-aminobenzothiazoles as selective neuronal nitric oxide synthase inhibitors. Bioorg Med Chem Lett 17:2540-4 (2007)  
Target
Name:
Nitric oxide synthase, endothelial
Synonyms:
Constitutive NOS Endothelial NOS NOS type III NOS3_HUMAN Nitric oxide synthase (inducible and endothelial) Nitric-oxide synthase (endothelial and brain) eNOS
Type:
Enzyme Catalytic Domain
Mol. Mass.:
133297.84
Organism:
Homo sapiens (Human)
Description:
P29474
Residue:
1203
  
Inhibitor
Name:
BDBM50206064
Synonyms:
CHEMBL233857 | N-[2-(1-benzyl-piperidin-4-ylamino)-benzothiazol-6-yl]-thiophene-2-carboxamidine
Type:
Small organic molecule
Emp. Form.:
C24H25N5S2
Mol. Mass.:
447.619
SMILES:
NC(=Nc1ccc2nc(NC3CCN(Cc4ccccc4)CC3)sc2c1)c1cccs1
: