Target
Nitric oxide synthase, inducible
Ligand
BDBM50206075
Substrate
Meas. Tech.
ChEMBL_442516 (CHEMBL892681)
IC50
>100000±n/a nM
Citation
 Patman, JBhardwaj, NRamnauth, JAnnedi, SCRenton, PMaddaford, SPRakhit, SAndrews, JS Novel 2-aminobenzothiazoles as selective neuronal nitric oxide synthase inhibitors. Bioorg Med Chem Lett 17:2540-4 (2007)  
Target
Name:
Nitric oxide synthase, inducible
Synonyms:
HEP-NOS Inducible NO synthase NOS type II NOS2A Nitric oxide synthase, inducible (iNOS) | iNOS
Type:
Homodimer
Mol. Mass.:
131141.95
Organism:
Homo sapiens (Human)
Description:
P35228
Residue:
1153
  
Inhibitor
Name:
BDBM50206075
Synonyms:
4-(4-{6-[(thiophene-2-carboximidoyl)-amino]-benzothiazol-2-ylamino}-piperidin-1-ylmethyl)-benzoic acid methyl ester | CHEMBL397710
Type:
Small organic molecule
Emp. Form.:
C26H27N5O2S2
Mol. Mass.:
505.655
SMILES:
COC(=O)c1ccc(CN2CCC(CC2)Nc2nc3ccc(cc3s2)N=C(N)c2cccs2)cc1
: