Target
Nitric oxide synthase, brain
Ligand
BDBM50206073
Substrate
Meas. Tech.
ChEMBL_442514 (CHEMBL892679)
IC50
1300±n/a nM
Citation
 Patman, JBhardwaj, NRamnauth, JAnnedi, SCRenton, PMaddaford, SPRakhit, SAndrews, JS Novel 2-aminobenzothiazoles as selective neuronal nitric oxide synthase inhibitors. Bioorg Med Chem Lett 17:2540-4 (2007)  
Target
Name:
Nitric oxide synthase, brain
Synonyms:
Constitutive NOS NC-NOS NOS type I nNOS NOS1_HUMAN Neuronal nitric oxide synthase Nitric oxide synthase, neuronal (nNOS) bNOS | nNOS
Type:
Homodimer
Mol. Mass.:
160985.98
Organism:
Homo sapiens (Human)
Description:
P29475
Residue:
1434
  
Inhibitor
Name:
BDBM50206073
Synonyms:
CHEMBL233652 | N-[2-(2-pyridin-2-yl-ethylamino)-benzothiazol-6-yl]-thiophene-2-carboxamidine
Type:
Small organic molecule
Emp. Form.:
C19H17N5S2
Mol. Mass.:
379.502
SMILES:
NC(=Nc1ccc2nc(NCCc3ccccn3)sc2c1)c1cccs1
: