Target
Nitric oxide synthase, inducible
Ligand
BDBM50206065
Substrate
Meas. Tech.
ChEMBL_442521 (CHEMBL892686)
IC50
19000±n/a nM
Citation
 Patman, JBhardwaj, NRamnauth, JAnnedi, SCRenton, PMaddaford, SPRakhit, SAndrews, JS Novel 2-aminobenzothiazoles as selective neuronal nitric oxide synthase inhibitors. Bioorg Med Chem Lett 17:2540-4 (2007)  
Target
Name:
Nitric oxide synthase, inducible
Synonyms:
NOS2_RAT | Nos2
Type:
PROTEIN
Mol. Mass.:
130642.55
Organism:
Rattus norvegicus
Description:
ChEMBL_976228
Residue:
1147
  
Inhibitor
Name:
BDBM50206065
Synonyms:
CHEMBL233655 | N-{2-[1-(3-methoxy-benzyl)-piperidin-4-ylamino]-benzothiazol-6-yl}-thiophene-2-carboxamidine
Type:
Small organic molecule
Emp. Form.:
C25H27N5OS2
Mol. Mass.:
477.645
SMILES:
COc1cccc(CN2CCC(CC2)Nc2nc3ccc(cc3s2)N=C(N)c2cccs2)c1
: