Target
Nitric oxide synthase, inducible
Ligand
BDBM50206082
Substrate
Meas. Tech.
ChEMBL_442516 (CHEMBL892681)
IC50
25000±n/a nM
Citation
 Patman, JBhardwaj, NRamnauth, JAnnedi, SCRenton, PMaddaford, SPRakhit, SAndrews, JS Novel 2-aminobenzothiazoles as selective neuronal nitric oxide synthase inhibitors. Bioorg Med Chem Lett 17:2540-4 (2007)  
Target
Name:
Nitric oxide synthase, inducible
Synonyms:
HEP-NOS Inducible NO synthase NOS type II NOS2A Nitric oxide synthase, inducible (iNOS) | iNOS
Type:
Homodimer
Mol. Mass.:
131141.95
Organism:
Homo sapiens (Human)
Description:
P35228
Residue:
1153
  
Inhibitor
Name:
BDBM50206082
Synonyms:
CHEMBL397506 | N-(2-amino-benzothiazol-6-yl)-thiophene-2-carboxamidine
Type:
Small organic molecule
Emp. Form.:
C12H10N4S2
Mol. Mass.:
274.365
SMILES:
NC(=Nc1ccc2nc(N)sc2c1)c1cccs1
: