Target
Nitric oxide synthase, endothelial
Ligand
BDBM50206068
Substrate
Meas. Tech.
ChEMBL_442515 (CHEMBL892680)
IC50
2100±n/a nM
Citation
 Patman, JBhardwaj, NRamnauth, JAnnedi, SCRenton, PMaddaford, SPRakhit, SAndrews, JS Novel 2-aminobenzothiazoles as selective neuronal nitric oxide synthase inhibitors. Bioorg Med Chem Lett 17:2540-4 (2007)  
Target
Name:
Nitric oxide synthase, endothelial
Synonyms:
Constitutive NOS Endothelial NOS NOS type III NOS3_HUMAN Nitric oxide synthase (inducible and endothelial) Nitric-oxide synthase (endothelial and brain) eNOS
Type:
Enzyme Catalytic Domain
Mol. Mass.:
133297.84
Organism:
Homo sapiens (Human)
Description:
P29474
Residue:
1203
  
Inhibitor
Name:
BDBM50206068
Synonyms:
CHEMBL233654 | N-(2-{1-[2-(4-Bromo-phenyl)-ethyl]-piperidin-4-ylamino}-benzothiazol-6-yl)-thiophene-2-carboxamidine
Type:
Small organic molecule
Emp. Form.:
C25H26BrN5S2
Mol. Mass.:
540.541
SMILES:
NC(=Nc1ccc2nc(NC3CCN(CCc4ccc(Br)cc4)CC3)sc2c1)c1cccs1
: