Target
Bifunctional epoxide hydrolase 2
Ligand
BDBM50217468
Substrate
Meas. Tech.
ChEMBL_444681 (CHEMBL894930)
IC50
2.7±n/a nM
Citation
 Hwang, SHTsai, HJLiu, JYMorisseau, CHammock, BD Orally bioavailable potent soluble epoxide hydrolase inhibitors. J Med Chem 50:3825-40 (2007)  
Target
Name:
Bifunctional epoxide hydrolase 2
Synonyms:
Cytosolic epoxide hydrolase 2 EPHX2 HYES_HUMAN Soluble epoxide hydrolase (sEH) | epoxide hydrolase 2, cytoplasmic
Type:
Enzyme
Mol. Mass.:
62613.07
Organism:
Homo sapiens (Human)
Description:
P34913
Residue:
555
  
Inhibitor
Name:
BDBM50217468
Synonyms:
1-adamantan-1-yl-3-[4-(4-fluorophenoxy)phenyl]urea | CHEMBL388015
Type:
Small organic molecule
Emp. Form.:
C23H25FN2O2
Mol. Mass.:
380.4552
SMILES:
Fc1ccc(Oc2ccc(NC(=O)NC34CC5CC(CC(C5)C3)C4)cc2)cc1
: