Target
Glutamate receptor 2
Ligand
BDBM50166287
Substrate
Meas. Tech.
ChEMBL_445373 (CHEMBL895664)
EC50
1000000±n/a nM
Citation
 Jensen, AAChristesen, TBølcho, UGreenwood, JRPostorino, GVogensen, SBJohansen, TNEgebjerg, JBräuner-Osborne, HClausen, RP Functional characterization of Tet-AMPA [tetrazolyl-2-amino-3-(3-hydroxy-5-methyl- 4-isoxazolyl)propionic acid] analogues at ionotropic glutamate receptors GluR1-GluR4. The molecular basis for the functional selectivity profile of 2-Bn-Tet-AMPA. J Med Chem 50:4177-85 (2007)  
Target
Name:
Glutamate receptor 2
Synonyms:
AMPA-selective glutamate receptor 2 GRIA2 GluR-2 GluR-K2 Glutamate receptor 2 Glutamate receptor AMPA 2/3 Glutamate receptor ionotropic, AMPA 2
Type:
Enzyme Catalytic Domain
Mol. Mass.:
98825.96
Organism:
Homo sapiens (Human)
Description:
Glutamate AMPA 2 GRIA2 HUMAN::P42262
Residue:
883
  
Inhibitor
Name:
BDBM50166287
Synonyms:
(RS)-2-amino-3-[3-hydroxy-5-(2-isopropyl-2H-5-tetrazolyl)-4-isoxazolyl]propionic acid 2-amino-3-(3-hydroxy-5-(2-isopropyl-2H-tetrazol-5-yl)isoxazol-4-yl)propanoic acid | CHEMBL193087
Type:
Small organic molecule
Emp. Form.:
C10H14N6O4
Mol. Mass.:
282.256
SMILES:
CC(C)n1nnc(n1)-c1o[nH]c(=O)c1CC(N)C(O)=O
: