Target
Glutamate receptor 4
Ligand
BDBM50211399
Substrate
Meas. Tech.
ChEMBL_445397 (CHEMBL895688)
EC50
490000±n/a nM
Citation
 Jensen, AAChristesen, TBølcho, UGreenwood, JRPostorino, GVogensen, SBJohansen, TNEgebjerg, JBräuner-Osborne, HClausen, RP Functional characterization of Tet-AMPA [tetrazolyl-2-amino-3-(3-hydroxy-5-methyl- 4-isoxazolyl)propionic acid] analogues at ionotropic glutamate receptors GluR1-GluR4. The molecular basis for the functional selectivity profile of 2-Bn-Tet-AMPA. J Med Chem 50:4177-85 (2007)  
Target
Name:
Glutamate receptor 4
Synonyms:
GLUR4 GRIA4_HUMAN Glutamate receptor ionotropic AMPA | Glutamate receptor ionotropic, AMPA 4
Type:
PROTEIN
Mol. Mass.:
100881.87
Organism:
Homo sapiens (Human)
Description:
ChEMBL_468628
Residue:
902
  
Inhibitor
Name:
BDBM50211399
Synonyms:
(RS)-2-amino-3-[3-hydroxy-5-(2-benzyl-2H-5-tetrazolyl)-4-isoxazolyl]propionic acid CHEMBL388746
Type:
Small organic molecule
Emp. Form.:
C14H14N6O4
Mol. Mass.:
330.2988
SMILES:
NC(Cc1c(o[nH]c1=O)-c1nnn(Cc2ccccc2)n1)C(O)=O
: