Target
Metabotropic glutamate receptor 1
Ligand
BDBM50220151
Substrate
Meas. Tech.
ChEMBL_446048 (CHEMBL895144)
Ki
>300000±n/a nM
Citation
 Pellicciari, RMarinozzi, MMacchiarulo, AFulco, MCGafarova, JSerpi, MGiorgi, GNielsen, SThomsen, C Synthesis, molecular modeling studies, and preliminary pharmacological characterization of all possible 2-(2'-sulfonocyclopropyl)glycine stereoisomers as conformationally constrained L-homocysteic acid analogs. J Med Chem 50:4630-41 (2007)  
Target
Name:
Metabotropic glutamate receptor 1
Synonyms:
GPRC1A GRM1_HUMAN Metabotropic Glutamate 1a | metabotropic glutamate 1
Type:
Enzyme
Mol. Mass.:
132358.19
Organism:
Homo sapiens (Human)
Description:
Q13255
Residue:
1194
  
Inhibitor
Name:
BDBM50220151
Synonyms:
(2R,1'S,2'S)-2-(2'-sulfonocyclopropyl)glycine | CHEMBL230949
Type:
Small organic molecule
Emp. Form.:
C5H9NO5S
Mol. Mass.:
195.194
SMILES:
N[C@H]([C@@H]1C[C@@H]1S(O)(=O)=O)C(O)=O
: