Target
Metabotropic glutamate receptor 4
Ligand
BDBM50220146
Substrate
Meas. Tech.
ChEMBL_446051 (CHEMBL895143)
Ki
>300000±n/a nM
Citation
 Pellicciari, RMarinozzi, MMacchiarulo, AFulco, MCGafarova, JSerpi, MGiorgi, GNielsen, SThomsen, C Synthesis, molecular modeling studies, and preliminary pharmacological characterization of all possible 2-(2'-sulfonocyclopropyl)glycine stereoisomers as conformationally constrained L-homocysteic acid analogs. J Med Chem 50:4630-41 (2007)  
Target
Name:
Metabotropic glutamate receptor 4
Synonyms:
GPRC1D GRM4_HUMAN MGLUR4 Metabotropic glutamate receptor 4 (mGlu4) metabotropic glutamate 4
Type:
Protein
Mol. Mass.:
101899.95
Organism:
Homo sapiens (Human)
Description:
Q14833
Residue:
912
  
Inhibitor
Name:
BDBM50220146
Synonyms:
(2S,1'S,2'S)-2-(2'-sulfonocyclopropyl)glycine | CHEMBL389558
Type:
Small organic molecule
Emp. Form.:
C5H9NO5S
Mol. Mass.:
195.194
SMILES:
N[C@@H]([C@@H]1C[C@@H]1S(O)(=O)=O)C(O)=O
: