Target
Metabotropic glutamate receptor 2
Ligand
BDBM50220149
Substrate
Meas. Tech.
ChEMBL_446049 (CHEMBL895145)
Ki
>300000±n/a nM
Citation
 Pellicciari, RMarinozzi, MMacchiarulo, AFulco, MCGafarova, JSerpi, MGiorgi, GNielsen, SThomsen, C Synthesis, molecular modeling studies, and preliminary pharmacological characterization of all possible 2-(2'-sulfonocyclopropyl)glycine stereoisomers as conformationally constrained L-homocysteic acid analogs. J Med Chem 50:4630-41 (2007)  
Target
Name:
Metabotropic glutamate receptor 2
Synonyms:
GPRC1B GRM2_HUMAN Metabotropic glutamate receptor mGlu2 | metabotropic glutamate 2
Type:
Enzyme
Mol. Mass.:
95584.88
Organism:
Homo sapiens (Human)
Description:
Q14416
Residue:
872
  
Inhibitor
Name:
BDBM50220149
Synonyms:
(2S,1'S,2'R)-2-(2'-sulfonocyclopropyl)glycine | CHEMBL389555
Type:
Small organic molecule
Emp. Form.:
C5H9NO5S
Mol. Mass.:
195.194
SMILES:
N[C@@H]([C@@H]1C[C@H]1S(O)(=O)=O)C(O)=O
: