Target
Progesterone receptor
Ligand
BDBM50219461
Substrate
Meas. Tech.
ChEMBL_448943 (CHEMBL899206)
IC50
>1600±n/a nM
Citation
 Kuzmich, DKirrane, TProudfoot, JBekkali, YZindell, RBeck, LNelson, RShih, CKKukulka, AJPaw, ZReilly, PDeleon, RCardozo, MNabozny, GThomson, D Identification of dissociated non-steroidal glucocorticoid receptor agonists. Bioorg Med Chem Lett 17:5025-31 (2007)  
Target
Name:
Progesterone receptor
Synonyms:
NR3C3 PGR PRGR_HUMAN | progesterone
Type:
Protein
Mol. Mass.:
98979.52
Organism:
Homo sapiens (Human)
Description:
P06401
Residue:
933
  
Inhibitor
Name:
BDBM50219461
Synonyms:
2-benzyl-1,1,1-trifluoro-4-(5-fluoro-2-methoxyphenyl)-4-methylpentan-2-ol | CHEMBL400628
Type:
Small organic molecule
Emp. Form.:
C20H22F4O2
Mol. Mass.:
370.3811
SMILES:
COc1ccc(F)cc1C(C)(C)CC(O)(Cc1ccccc1)C(F)(F)F
: