Target
Muscarinic acetylcholine receptor
Ligand
BDBM50223163
Substrate
Meas. Tech.
ChEMBL_450061 (CHEMBL899156)
Kd
21878±n/a nM
Citation
 Dallanoce, CDe Amici, MBarocelli, EBertoni, SRoth, BLErnsberger, PDe Micheli, C Novel oxotremorine-related heterocyclic derivatives: Synthesis and in vitro pharmacology at the muscarinic receptor subtypes. Bioorg Med Chem 15:7626-37 (2007)  
Target
Name:
Muscarinic acetylcholine receptor
Synonyms:
GPM3 | Muscarinic acetylcholine receptor M3
Type:
Mol. Mass.:
66272.13
Organism:
Cavia porcellus
Description:
Residue:
587
  
Inhibitor
Name:
BDBM50223163
Synonyms:
1-[4-(4,5-dihydroisoxazol-3-yloxy)but-2-yn-1-yl]piperidine oxalate | CHEMBL239866
Type:
Small organic molecule
Emp. Form.:
C12H19N2O2
Mol. Mass.:
223.2909
SMILES:
C(OC1=NOCC1)C#CC[NH+]1CCCCC1
: