Target
Trans-2-enoyl-ACP reductase II
Ligand
BDBM50219766
Substrate
Meas. Tech.
ChEMBL_450119 (CHEMBL900394)
IC50
5.3±n/a nM
Citation
 Ozawa, TKitagawa, HYamamoto, YTakahata, SIida, MOsaki, YYamada, K Phenylimidazole derivatives as specific inhibitors of bacterial enoyl-acyl carrier protein reductase FabK. Bioorg Med Chem 15:7325-36 (2007)  
Target
Name:
Trans-2-enoyl-ACP reductase II
Synonyms:
Enoyl-ACP Reductase (FabK) NADH-dependent, FAD-containing enoyl-ACP | trans-2-enoyl-ACP reductase II
Type:
Enzyme
Mol. Mass.:
34170.89
Organism:
Streptococcus pneumoniae
Description:
Residue:
324
  
Inhibitor
Name:
BDBM50219766
Synonyms:
1-((4-(3-bromophenyl)-1H-imidazol-2-yl)methyl)-3-(5-(pyridin-2-ylthio)thiazol-2-yl)urea CHEMBL390894
Type:
Small organic molecule
Emp. Form.:
C19H15BrN6OS2
Mol. Mass.:
487.396
SMILES:
Brc1cccc(c1)-c1c[nH]c(CNC(=O)Nc2ncc(Sc3ccccn3)s2)n1
: