Target
Muscarinic acetylcholine receptor M2
Ligand
BDBM50225209
Substrate
Meas. Tech.
ChEMBL_451100 (CHEMBL900173)
EC50
1.3±n/a nM
Citation
 Elsinghorst, PWCieslik, JSMohr, KTränkle, CGütschow, M First gallamine-tacrine hybrid: design and characterization at cholinesterases and the M2 muscarinic receptor. J Med Chem 50:5685-95 (2007)  
Target
Name:
Muscarinic acetylcholine receptor M2
Synonyms:
ACM2_PIG Cholinergic, muscarinic LOC100715343 Muscarinic receptor 2
Type:
Enzyme Catalytic Domain
Mol. Mass.:
51688.65
Organism:
GUINEA PIG
Description:
Cholinergic, muscarinic 0 GUINEA PIG::P06199
Residue:
466
  
Inhibitor
Name:
BDBM50225209
Synonyms:
N,N,N-triethyl-2-(4-(((6-(2-(1,2,3,4-tetrahydroacridin-9-yl)-hydrazino)-6-oxohexyl)amino)carbonyl)phenoxy)ethanammoniumbromide hydrochloride
Type:
Small organic molecule
Emp. Form.:
C34H48N5O3
Mol. Mass.:
574.7761
SMILES:
CC[N+](CC)(CC)CCOc1ccc(cc1)C(=O)NCCCCCC(=O)NNc1c2CCCCc2nc2ccccc12
: