Target
Prothrombin
Ligand
BDBM50228426
Substrate
Meas. Tech.
ChEMBL_452512 (CHEMBL902751)
IC50
8100±n/a nM
Citation
 Joossens, JAli, OMEl-Sayed, ISurpateanu, GVan der Veken, PLambeir, AMSetyono-Han, BFoekens, JASchneider, ASchmalix, WHaemers, AAugustyns, K Small, potent, and selective diaryl phosphonate inhibitors for urokinase-type plasminogen activator with in vivo antimetastatic properties. J Med Chem 50:6638-46 (2007)  
Target
Name:
Prothrombin
Synonyms:
Activation peptide fragment 1 Coagulation factor II Prothrombin precursor Thrombin heavy chain | Thrombin light chain
Type:
Protein
Mol. Mass.:
70029.57
Organism:
Homo sapiens (Human)
Description:
P00734
Residue:
622
  
Inhibitor
Name:
BDBM50228426
Synonyms:
CHEMBL391344 | diphenyl 1-(naphthalenesulfonylamino)-2-(4-guanidinophenyl)-ethanephosphonate
Type:
Small organic molecule
Emp. Form.:
C31H29N4O5PS
Mol. Mass.:
600.625
SMILES:
[#7]\[#6](-[#7])=[#7]\c1ccc(-[#6]-[#6](-[#7]S(=O)(=O)c2cccc3ccccc23)P(=O)([#8]-c2ccccc2)[#8]-c2ccccc2)cc1
: