Target
Nuclear receptor subfamily 4 group A member 2
Ligand
BDBM50371205
Substrate
Meas. Tech.
ChEMBL_453027 (CHEMBL902174)
EC50
31.9±n/a nM
Citation
 Hintermann, SChiesi, Mvon Krosigk, UMathé, DFelber, RHengerer, B Identification of a series of highly potent activators of the Nurr1 signaling pathway. Bioorg Med Chem Lett 17:193-6 (2006)  
Target
Name:
Nuclear receptor subfamily 4 group A member 2
Synonyms:
NOT NR4A2_HUMAN TINUR
Type:
PROTEIN
Mol. Mass.:
66603.77
Organism:
Homo sapiens (Human)
Description:
ChEMBL_453027
Residue:
598
  
Inhibitor
Name:
BDBM50371205
Synonyms:
CHEMBL393713
Type:
Small organic molecule
Emp. Form.:
C25H26N4O2
Mol. Mass.:
414.4995
SMILES:
CN1CCN(Cc2ccc(cc2)-c2cc3onc(-c4ccccc4)c3c(=O)n2C)CC1
: