Target
Nuclear receptor subfamily 4 group A member 2
Ligand
BDBM50371209
Substrate
Meas. Tech.
ChEMBL_453027 (CHEMBL902174)
EC50
59.2±n/a nM
Citation
 Hintermann, SChiesi, Mvon Krosigk, UMathé, DFelber, RHengerer, B Identification of a series of highly potent activators of the Nurr1 signaling pathway. Bioorg Med Chem Lett 17:193-6 (2006)  
Target
Name:
Nuclear receptor subfamily 4 group A member 2
Synonyms:
NOT NR4A2_HUMAN TINUR
Type:
PROTEIN
Mol. Mass.:
66603.77
Organism:
Homo sapiens (Human)
Description:
ChEMBL_453027
Residue:
598
  
Inhibitor
Name:
BDBM50371209
Synonyms:
CHEMBL246654
Type:
Small organic molecule
Emp. Form.:
C21H18N2O4
Mol. Mass.:
362.3786
SMILES:
COc1ccc(c(OC)c1)-c1cc2onc(-c3ccccc3)c2c(=O)n1C
: