Target
Metabotropic glutamate receptor 5
Ligand
BDBM50202125
Substrate
Meas. Tech.
ChEMBL_454007 (CHEMBL903194)
EC50
>100000±n/a nM
Citation
 Zhao, ZWisnoski, DDO'Brien, JALemaire, WWilliams, DLJacobson, MAWittman, MHa, SNSchaffhauser, HSur, CPettibone, DJDuggan, MEConn, PJHartman, GDLindsley, CW Challenges in the development of mGluR5 positive allosteric modulators: the discovery of CPPHA. Bioorg Med Chem Lett 17:1386-91 (2007)  
Target
Name:
Metabotropic glutamate receptor 5
Synonyms:
GPRC1E GRM5_HUMAN metabotropic glutamate 5 | metabotropic glutamate 5a
Type:
Enzyme
Mol. Mass.:
132484.72
Organism:
Homo sapiens (Human)
Description:
Residue:
1212
  
Inhibitor
Name:
BDBM50202125
Synonyms:
CHEMBL247548 | N-(4-bromo-2-((4,5-dimethyl-1,3-dioxoisoindolin-2-yl)methyl)phenyl)picolinamide
Type:
Small organic molecule
Emp. Form.:
C23H18BrN3O3
Mol. Mass.:
464.311
SMILES:
Cc1ccc2C(=O)N(Cc3cc(Br)ccc3NC(=O)c3ccccn3)C(=O)c2c1C
: