Target
Metabotropic glutamate receptor 5
Ligand
BDBM50202132
Substrate
Meas. Tech.
ChEMBL_454007 (CHEMBL903194)
EC50
>100000±n/a nM
Citation
 Zhao, ZWisnoski, DDO'Brien, JALemaire, WWilliams, DLJacobson, MAWittman, MHa, SNSchaffhauser, HSur, CPettibone, DJDuggan, MEConn, PJHartman, GDLindsley, CW Challenges in the development of mGluR5 positive allosteric modulators: the discovery of CPPHA. Bioorg Med Chem Lett 17:1386-91 (2007)  
Target
Name:
Metabotropic glutamate receptor 5
Synonyms:
GPRC1E GRM5_HUMAN metabotropic glutamate 5 | metabotropic glutamate 5a
Type:
Enzyme
Mol. Mass.:
132484.72
Organism:
Homo sapiens (Human)
Description:
Residue:
1212
  
Inhibitor
Name:
BDBM50202132
Synonyms:
CHEMBL395645 | N-(4-chloro-2-((4,5-dimethoxy-1,3-dioxoisoindolin-2-yl)methyl)phenyl)picolinamide
Type:
Small organic molecule
Emp. Form.:
C23H18ClN3O5
Mol. Mass.:
451.859
SMILES:
COc1ccc2C(=O)N(Cc3cc(Cl)ccc3NC(=O)c3ccccn3)C(=O)c2c1OC
: