Target
Alpha-2C adrenergic receptor
Ligand
BDBM50203561
Substrate
Meas. Tech.
ChEMBL_454217 (CHEMBL903400)
Ki
3.5±n/a nM
Citation
 Hagihara, KKashima, HIida, KEnokizono, JUchida, SNonaka, HKurokawa, MShimada, J Novel 4-(6,7-dimethoxy-1,2,3,4-tetrahydroisoquinolin-2-yl)methylbenzofuran derivatives as selective alpha(2C)-adrenergic receptor antagonists. Bioorg Med Chem Lett 17:1616-21 (2007)  
Target
Name:
Alpha-2C adrenergic receptor
Synonyms:
ADA2C_HUMAN ADRA2L2 Adrenergic alpha2C Adrenergic receptor alpha Alpha-2 adrenergic receptor subtype C4 Alpha-2C adrenoreceptor | adrenergic, alpha-2C-, receptor [Homo sapiens]
Type:
Enzyme
Mol. Mass.:
49552.32
Organism:
Homo sapiens (Human)
Description:
P18825
Residue:
462
  
Inhibitor
Name:
BDBM50203561
Synonyms:
(4-((6,7-dimethoxy-3,4-dihydroisoquinolin-2(1H)-yl)methyl)-7-methoxybenzofuran-2-yl)(4-(pyrrolidin-1-yl)piperidin-1-yl)methanone | CHEMBL247665
Type:
Small organic molecule
Emp. Form.:
C31H39N3O5
Mol. Mass.:
533.6585
SMILES:
COc1cc2CCN(Cc3ccc(OC)c4oc(cc34)C(=O)N3CCC(CC3)N3CCCC3)Cc2cc1OC
: