Target
Potassium voltage-gated channel subfamily H member 2
Ligand
BDBM50205792
Substrate
Meas. Tech.
ChEMBL_454647 (CHEMBL886667)
Ki
4200±n/a nM
Citation
 Wilson, KJvan Niel, MBCooper, LBloomfield, DO'Connor, DFish, LRMacLeod, AM 2,5-Disubstituted pyridines: the discovery of a novel series of 5-HT2A ligands. Bioorg Med Chem Lett 17:2643-8 (2007)  
Target
Name:
Potassium voltage-gated channel subfamily H member 2
Synonyms:
1,3-beta-glucan synthase component GLS2 ERG Eag-related protein 1 Ether-a-go-go-related gene (HERG) Ether-a-go-go-related gene potassium channel 1 Ether-a-go-go-related gene potassium channel 1 (hERG1) Ether-a-go-go-related protein 1 H-ERG KCNH2 Potassium voltage-gated channel subfamily H member 2 (hERG) Voltage-gated potassium channel subunit Kv11.1 hERG Potassium Channel 1 | putative potassium channel subunit
Type:
Multi-pass membrane protein
Mol. Mass.:
126672.65
Organism:
Homo sapiens (Human)
Description:
Q12809
Residue:
1159
  
Inhibitor
Name:
BDBM50205792
Synonyms:
(E)-5-(2-fluorophenylsulfonyl)-2-(2-(pyridin-4-yl)vinyl)pyridine | CHEMBL240864
Type:
Small organic molecule
Emp. Form.:
C18H13FN2O2S
Mol. Mass.:
340.371
SMILES:
Fc1ccccc1S(=O)(=O)c1ccc(\C=C\c2ccncc2)nc1
: