Target
Progesterone receptor
Ligand
BDBM50222090
Substrate
Meas. Tech.
ChEMBL_457750 (CHEMBL924027)
IC50
82±n/a nM
Citation
 Jin, CManikumar, GKepler, JACook, CEAllan, GFKiddoe, MBhattacharjee, SLinton, OLundeen, SGSui, Z Synthesis and identification of novel 11beta-aryl-4',5'-dihydrospiro[estra-4,9-diene-17beta,4'-oxazole] analogs with dissociated antiprogesterone activities. Bioorg Med Chem Lett 17:5754-7 (2007)  
Target
Name:
Progesterone receptor
Synonyms:
NR3C3 PGR PRGR_HUMAN | progesterone
Type:
Protein
Mol. Mass.:
98979.52
Organism:
Homo sapiens (Human)
Description:
P06401
Residue:
933
  
Inhibitor
Name:
BDBM50222090
Synonyms:
(3S,10'S,11'S,15'S,17'R)-17'-(4-acetylphenyl)-15'-methyl-2-methylidene-2H-spiro[1,4-oxazole-3,14'-tetracyclo[8.7.0.0^{2,7}.0^{11,15}]heptadecane]-1',6'-dien-5'-one | CHEMBL250221
Type:
Small organic molecule
Emp. Form.:
C29H31NO3
Mol. Mass.:
441.5613
SMILES:
CC(=O)c1ccc(cc1)[C@H]1C[C@@]2(C)[C@@H](CC[C@]22N=COC2=C)[C@@H]2CCC3=CC(=O)CCC3=C12
: